Target
Alpha-1A adrenergic receptor
Ligand
BDBM50033312
Substrate
Ki
3.16±n/a nM
Comments
PDSP_181
Citation
 Schwinn, DAJohnston, GIPage, SOMosley, MJWilson, KHWorman, NPCampbell, SFidock, MDFurness, LMParry-Smith, DJ Cloning and pharmacological characterization of human alpha-1 adrenergic receptors: sequence corrections and direct comparison with other species homologues. J Pharmacol Exp Ther 272:134-42 (1995) Target
Name:
Alpha-1A adrenergic receptor
Synonyms:
ADA1A_HUMAN ADRA1C Alpha 1A-adrenoceptor Alpha adrenergic receptor 1a Alpha-adrenergic receptor 1c adrenergic Alpha1 | adrenergic Alpha1C
Type:
Cell-surface receptors
Mol. Mass.:
51511.67
Organism:
Homo sapiens (Human)
Description:
P35348
Residue:
466
  
Inhibitor
Name:
BDBM50033312
Synonyms:
Benzyl-(6-chloro-2-imidazol-1-yl-quinazolin-4-yl)-amine; dihydrochloride Urapidil-5-methyl
Type:
Small organic molecule
Emp. Form.:
C18H14ClN5
Mol. Mass.:
335.79
SMILES:
Clc1ccc2nc(nc(NCc3ccccc3)c2c1)-n1ccnc1
: