Target
5-hydroxytryptamine receptor 1A
Ligand
BDBM50073444
Substrate
Ki
96±n/a nM
Comments
PDSP_1905
Citation
 Cusack, BNelson, ARichelson, E Binding of antidepressants to human brain receptors: focus on newer generation compounds. Psychopharmacology (Berl) 114:559-65 (1994)  
Target
Name:
5-hydroxytryptamine receptor 1A
Synonyms:
5-HT-1A 5-hydroxytryptamine receptor 1A (5-HT-1A) ADRB2RL1 Dopamine D2 receptor and serotonin 1a receptor HTR1A | Serotonin receptor 1A
Type:
Mol. Mass.:
46122.49
Organism:
Homo sapiens (Human)
Description:
Residue:
422
  
Inhibitor
Name:
BDBM50073444
Synonyms:
2-{3-[4-(3-chlorophenyl)piperazin-1-yl]propyl}[1,2,4]triazolo[4,3-a]pyridin-3(2H)-one TRAZODONE
Type:
Small organic molecule
Emp. Form.:
C19H22ClN5O
Mol. Mass.:
371.864
SMILES:
Clc1cccc(c1)N1CCN(CCCn2nc3ccccn3c2=O)CC1
: