Target
Somatostatin receptor type 2
Ligand
BDBM82463
Substrate
Ki
28.84±n/a nM
Comments
PDSP_1033
Citation
 Hoyer, DLübbert, HBruns, C Molecular pharmacology of somatostatin receptors. Naunyn Schmiedebergs Arch Pharmacol 350:441-53 (1994)  
Target
Name:
Somatostatin receptor type 2
Synonyms:
SOMATOSTATIN SST2 Smstr2 Somatostatin receptor 2 Sst2 | Sstr2
Type:
Enzyme Catalytic Domain
Mol. Mass.:
41234.26
Organism:
MOUSE
Description:
SOMATOSTATIN SST2 SSTR2 MOUSE::P30875
Residue:
369
  
Inhibitor
Name:
BDBM82463
Synonyms:
Cyclo[L-Trp-D-Trp-L-Lys-L-Thr-L-Phe-(7-amino*heptanoyl-L-Phe-)] L-362855
Type:
Small organic molecule
Emp. Form.:
C57H70N10O8
Mol. Mass.:
1023.2279
SMILES:
C[C@@H](O)[C@@H]1NC(=O)[C@H](CCCCN)NC(=O)[C@@H](Cc2c[nH]c3ccccc23)NC(=O)[C@H](Cc2c[nH]c3ccccc23)NC(=O)[C@H](Cc2ccccc2)NC(=O)CCCCCCNC(=O)[C@H](Cc2ccccc2)NC1=O
: