Target
Somatostatin receptor type 4
Ligand
BDBM82470
Substrate
Ki
1000±n/a nM
Comments
PDSP_373
Citation
 Hoyer, DLübbert, HBruns, C Molecular pharmacology of somatostatin receptors. Naunyn Schmiedebergs Arch Pharmacol 350:441-53 (1994)  
Target
Name:
Somatostatin receptor type 4
Synonyms:
SS-4-R SS4R Smstr4 | Sstr4
Type:
PROTEIN
Mol. Mass.:
41937.48
Organism:
Mus musculus
Description:
ChEMBL_833920
Residue:
385
  
Inhibitor
Name:
BDBM82470
Synonyms:
3-(2-Naphtyl)-D-Ala-L-Cys(1)-L-Tyr-D-Trp-L-Lys-L-Val-L-Cys(1)-L-Thr-NH2 BIM-23014 | LANREOTIDE
Type:
Small organic molecule
Emp. Form.:
C54H69N11O10S2
Mol. Mass.:
1096.323
SMILES:
CC(C)[C@@H]1NC(=O)[C@H](CCCCN)NC(=O)[C@@H](Cc2c[nH]c3ccccc23)NC(=O)[C@H](Cc2ccc(O)cc2)NC(=O)[C@H](CSSC[C@H](NC1=O)C(=O)N[C@@H]([C@@H](C)O)C(N)=O)NC(=O)[C@H](N)Cc1ccc2ccccc2c1
: