Target
Somatostatin receptor type 5
Ligand
BDBM82466
Substrate
Ki
0.46±n/a nM
Comments
PDSP_1034
Citation
 Hoyer, DLübbert, HBruns, C Molecular pharmacology of somatostatin receptors. Naunyn Schmiedebergs Arch Pharmacol 350:441-53 (1994)  
Target
Name:
Somatostatin receptor type 5
Synonyms:
SOMATOSTATIN SST5 Somatostatin receptor Sstr5
Type:
Enzyme Catalytic Domain
Mol. Mass.:
39986.50
Organism:
RAT
Description:
SOMATOSTATIN SST5 SSTR5 RAT::P30938
Residue:
363
  
Inhibitor
Name:
BDBM82466
Synonyms:
L-362,862 c[Aha-Phe-p-C1-Phe-D-Trp-Lys-Thr-Phe]
Type:
Small organic molecule
Emp. Form.:
C55H68ClN9O8
Mol. Mass.:
1018.637
SMILES:
C[C@@H](O)[C@@H]1NC(=O)[C@H](CCCCN)NC(=O)[C@@H](Cc2c[nH]c3ccccc23)NC(=O)[C@H](Cc2ccccc2)NC(=O)[C@H](Cc2ccc(Cl)cc2)NC(=O)CCCCCCNC(=O)[C@H](Cc2ccccc2)NC1=O
: