Target
5-hydroxytryptamine receptor 3A
Ligand
BDBM82474
Substrate
Ki
0.94±n/a nM
Comments
PDSP_3690
Citation
 Green, TStauffer, KALummis, SC Expression of recombinant homo-oligomeric 5-hydroxytryptamine3 receptors provides new insights into their maturation and structure. J Biol Chem 270:6056-61 (1995)  
Target
Name:
5-hydroxytryptamine receptor 3A
Synonyms:
5-HT-3 5-HT3A 5-HT3R 5-hydroxytryptamine receptor 3A 5ht3 Htr3a Serotonin 3a (5-HT3a) receptor Serotonin-gated ion channel receptor
Type:
Mol. Mass.:
56056.00
Organism:
Mus musculus (house mouse)
Description:
5HT3A
Residue:
487
  
Inhibitor
Name:
BDBM82474
Synonyms:
1-(3-CHLOROPHENYL)BIGUANIDE HYDROCHLORIDE m-chloro-phenyl-biguanide
Type:
Small organic molecule
Emp. Form.:
C8H10ClN5
Mol. Mass.:
211.652
SMILES:
[#7]\[#6](-[#7])=[#7]\[#6](-[#7])=[#7]-c1cccc(Cl)c1
: