Target
Type-2 angiotensin II receptor
Ligand
BDBM82258
Substrate
Ki
>10000±n/a nM
Comments
PDSP_1089
Citation
 Keiser, JARyan, MJPanek, RLHodges, JCSircar, I Pharmacologic characterization of CI-996, a new angiotensin receptor antagonist. J Pharmacol Exp Ther 272:963-9 (1995) Target
Name:
Type-2 angiotensin II receptor
Synonyms:
AGTR2_RAT Agtr2 Angiotensin II receptor Type-2 angiotensin II receptor
Type:
Enzyme Catalytic Domain
Mol. Mass.:
41346.62
Organism:
RAT
Description:
Angiotensin II AT2 0 0::P35351
Residue:
363
  
Inhibitor
Name:
BDBM82258
Synonyms:
CAS_114798-26-4 NSC_3961
Type:
Small organic molecule
Emp. Form.:
C22H23ClN6O
Mol. Mass.:
422.911
SMILES:
CCCCc1nc(Cl)c(CO)n1Cc1ccc(cc1)-c1ccccc1-c1nnn[nH]1
: