Target
5-hydroxytryptamine receptor 6
Ligand
BDBM50130290
Substrate
Ki
5000±n/a nM
Comments
PDSP_1247
Citation
 Roth, BLCraigo, SCChoudhary, MSUluer, AMonsma, FJShen, YMeltzer, HYSibley, DR Binding of typical and atypical antipsychotic agents to 5-hydroxytryptamine-6 and 5-hydroxytryptamine-7 receptors. J Pharmacol Exp Ther 268:1403-10 (1994) Target
Name:
5-hydroxytryptamine receptor 6
Synonyms:
5-HT-6 5-hydroxytryptamine receptor 6 Htr6 Serotonin (5-HT) receptor Serotonin receptor 6
Type:
Enzyme Catalytic Domain
Mol. Mass.:
46945.51
Organism:
RAT
Description:
5-HT6 HTR6 RAT::P31388
Residue:
436
  
Inhibitor
Name:
BDBM50130290
Synonyms:
3-Ethyl-2-methyl-5-morpholin-4-ylmethyl-1,5,6,7-tetrahydro-indol-4-one CHEMBL460 Moban
Type:
Small organic molecule
Emp. Form.:
C16H24N2O2
Mol. Mass.:
276.374
SMILES:
CCc1c(C)[nH]c2CCC(CN3CCOCC3)C(=O)c12
: