Target
5-hydroxytryptamine receptor 7
Ligand
BDBM50040237
Substrate
Ki
4.3±n/a nM
Comments
PDSP_551
Citation
 Roth, BLCraigo, SCChoudhary, MSUluer, AMonsma, FJShen, YMeltzer, HYSibley, DR Binding of typical and atypical antipsychotic agents to 5-hydroxytryptamine-6 and 5-hydroxytryptamine-7 receptors. J Pharmacol Exp Ther 268:1403-10 (1994) Target
Name:
5-hydroxytryptamine receptor 7
Synonyms:
5-HT-7 5-HT7 5-HT7S 5-hydroxytryptamine receptor 7 5HT7R_RAT GPRFO Serotonin (5-HT) receptor | Serotonin Receptor 7
Type:
G Protein-Coupled Receptor (GPCR)
Mol. Mass.:
49852.62
Organism:
Rattus norvegicus (rat)
Description:
Rat cloned 5-HT7R.
Residue:
448
  
Inhibitor
Name:
BDBM50040237
Synonyms:
2-Chloro-11-(4-methyl-piperazin-1-yl)-dibenzo[b,f][1,4]thiazepine 2-chloro-11-(4-methylpiperazin-1-yl)dibenzo[b,f][1,4]thiazepine Clothiapine
Type:
Small organic molecule
Emp. Form.:
C18H18ClN3S
Mol. Mass.:
343.874
SMILES:
CN1CCN(CC1)C1=Nc2ccccc2Sc2ccc(Cl)cc12
: