Target
Gastrin/cholecystokinin type B receptor
Ligand
BDBM50056101
Substrate
Ki
63±n/a nM
Comments
PDSP_2202
Citation
 Nishida, AMiyata, KTsutsumi, RYuki, HAkuzawa, SKobayashi, AKamato, TIto, HYamano, MKatuyama, Y Pharmacological profile of (R)-1-[2,3-dihydro-1-(2'-methylphenacyl)-2-oxo- 5-phenyl-1H-1,4-benzodiazepin-3-yl]-3-(3-methylphenyl)urea (YM022), a new potent and selective gastrin/cholecystokinin-B receptor antagonist, in vitro and in vivo. J Pharmacol Exp Ther 269:725-31 (1994) Target
Name:
Gastrin/cholecystokinin type B receptor
Synonyms:
Cckbr Cholecystokinin B receptor GASR_RAT | Gastrin/cholecystokinin type B receptor
Type:
Enzyme Catalytic Domain
Mol. Mass.:
48980.43
Organism:
RAT
Description:
Cholecystokinin A CCKBR RAT::P30553
Residue:
452
  
Inhibitor
Name:
BDBM50056101
Synonyms:
1-[(R)-2-Oxo-1-(2-oxo-2-o-tolyl-ethyl)-5-phenyl-2,3-dihydro-1H-benzo[e][1,4]diazepin-3-yl]-3-m-tolyl-urea YM022 | YM022 Racemate
Type:
Small organic molecule
Emp. Form.:
C32H28N4O3
Mol. Mass.:
516.5897
SMILES:
Cc1cccc(NC(=O)N[C@@H]2N=C(c3ccccc3)c3ccccc3N(CC(=O)c3ccccc3C)C2=O)c1
: