Target
Beta-1 adrenergic receptor
Ligand
BDBM50019443
Substrate
Ki
7.24±n/a nM
Comments
PDSP_1495
Citation
 Fraundorfer, PFFertel, RHMiller, DDFeller, DR Biochemical and pharmacological characterization of high-affinity trimetoquinol analogs on guinea pig and human beta adrenergic receptor subtypes: evidence for partial agonism. J Pharmacol Exp Ther 270:665-74 (1994) Target
Name:
Beta-1 adrenergic receptor
Synonyms:
ADRB1 adrenergic Beta1
Type:
Enzyme Catalytic Domain
Mol. Mass.:
50540.48
Organism:
GUINEA PIG
Description:
adrenergic Beta1 ADRB1 GUINEA PIG::B0FL73
Residue:
467
  
Inhibitor
Name:
BDBM50019443
Synonyms:
1-(1H-Indol-4-yloxy)-3-isopropylamino-propan-2-ol 1-(1H-Indol-4-yloxy)-3-isopropylamino-propan-2-ol(pindolol) LB-46 PINDOLOL,(-) VISKAZIDE | VISKEN
Type:
Small organic molecule
Emp. Form.:
C14H20N2O2
Mol. Mass.:
248.3208
SMILES:
CC(C)NCC(O)COc1cccc2[nH]ccc12
: