Target
Beta-1 adrenergic receptor
Ligand
BDBM25770
Substrate
Ki
>10000±n/a nM
Comments
PDSP_1799
Citation
 Fraundorfer, PFFertel, RHMiller, DDFeller, DR Biochemical and pharmacological characterization of high-affinity trimetoquinol analogs on guinea pig and human beta adrenergic receptor subtypes: evidence for partial agonism. J Pharmacol Exp Ther 270:665-74 (1994) Target
Name:
Beta-1 adrenergic receptor
Synonyms:
ADRB1 adrenergic Beta1
Type:
Enzyme Catalytic Domain
Mol. Mass.:
50540.48
Organism:
GUINEA PIG
Description:
adrenergic Beta1 ADRB1 GUINEA PIG::B0FL73
Residue:
467
  
Inhibitor
Name:
BDBM25770
Synonyms:
5-[2-(tert-butylamino)-1-hydroxyethyl]benzene-1,3-diol Brethaire Bricanyl Terbutaline,(+/-)
Type:
Small organic molecule
Emp. Form.:
C12H19NO3
Mol. Mass.:
225.2842
SMILES:
CC(C)(C)NCC(O)c1cc(O)cc(O)c1
: