Target
Beta-1 adrenergic receptor
Ligand
BDBM82487
Substrate
Ki
10.47±n/a nM
Comments
PDSP_1869
Citation
 Fraundorfer, PFFertel, RHMiller, DDFeller, DR Biochemical and pharmacological characterization of high-affinity trimetoquinol analogs on guinea pig and human beta adrenergic receptor subtypes: evidence for partial agonism. J Pharmacol Exp Ther 270:665-74 (1994) Target
Name:
Beta-1 adrenergic receptor
Synonyms:
ADRB1 adrenergic Beta1
Type:
Enzyme Catalytic Domain
Mol. Mass.:
50540.48
Organism:
GUINEA PIG
Description:
adrenergic Beta1 ADRB1 GUINEA PIG::B0FL73
Residue:
467
  
Inhibitor
Name:
BDBM82487
Synonyms:
TMQ, 3',5'-Diiodo
Type:
Small organic molecule
Emp. Form.:
C17H17I2NO3
Mol. Mass.:
537.1307
SMILES:
COc1c(I)cc(CC2NCCc3cc(O)c(O)cc23)cc1I
: