Target
Beta-1 adrenergic receptor
Ligand
BDBM82491
Substrate
Ki
14.79±n/a nM
Comments
PDSP_1872
Citation
 Fraundorfer, PFFertel, RHMiller, DDFeller, DR Biochemical and pharmacological characterization of high-affinity trimetoquinol analogs on guinea pig and human beta adrenergic receptor subtypes: evidence for partial agonism. J Pharmacol Exp Ther 270:665-74 (1994) Target
Name:
Beta-1 adrenergic receptor
Synonyms:
ADRB1 ADRB1_HUMAN Beta-1 adrenoceptor | adrenergic Beta1
Type:
G Protein-Coupled Receptor (GPCR)
Mol. Mass.:
51338.40
Organism:
Homo sapiens (Human)
Description:
P08588
Residue:
477
  
Inhibitor
Name:
BDBM82491
Synonyms:
TMQ, 3'-Nitro
Type:
Small organic molecule
Emp. Form.:
C18H20N2O6
Mol. Mass.:
360.3612
SMILES:
COc1cc(CC2NCCc3cc(O)c(O)cc23)cc(c1OC)[N+]([O-])=O
: