Target
Beta-2 adrenergic receptor
Ligand
BDBM82488
Substrate
Ki
10.23±n/a nM
Comments
PDSP_1875
Citation
 Fraundorfer, PFFertel, RHMiller, DDFeller, DR Biochemical and pharmacological characterization of high-affinity trimetoquinol analogs on guinea pig and human beta adrenergic receptor subtypes: evidence for partial agonism. J Pharmacol Exp Ther 270:665-74 (1994) Target
Name:
Beta-2 adrenergic receptor
Synonyms:
ADRB2 ADRB2_HUMAN Beta-2 adrenoceptor | Beta-2 adrenoreceptor
Type:
Mol. Mass.:
46461.69
Organism:
Homo sapiens (Human)
Description:
P07550
Residue:
413
  
Inhibitor
Name:
BDBM82488
Synonyms:
TMQ, 5-Iodo
Type:
Small organic molecule
Emp. Form.:
C19H22INO5
Mol. Mass.:
471.2862
SMILES:
COc1cc(CC2NCCc3c(I)c(O)c(O)cc23)cc(OC)c1OC
: