Target
Beta-2 adrenergic receptor
Ligand
BDBM82488
Substrate
Ki
11.48±n/a nM
Comments
PDSP_1875
Citation
 Fraundorfer, PFFertel, RHMiller, DDFeller, DR Biochemical and pharmacological characterization of high-affinity trimetoquinol analogs on guinea pig and human beta adrenergic receptor subtypes: evidence for partial agonism. J Pharmacol Exp Ther 270:665-74 (1994) Target
Name:
Beta-2 adrenergic receptor
Synonyms:
ADRB2_CAVPO adrenergic Beta2
Type:
Enzyme Catalytic Domain
Mol. Mass.:
46993.24
Organism:
GUINEA PIG
Description:
adrenergic Beta2 ADRB2 GUINEA PIG::Q8K4Z4
Residue:
418
  
Inhibitor
Name:
BDBM82488
Synonyms:
TMQ, 5-Iodo
Type:
Small organic molecule
Emp. Form.:
C19H22INO5
Mol. Mass.:
471.2862
SMILES:
COc1cc(CC2NCCc3c(I)c(O)c(O)cc23)cc(OC)c1OC
: