Target
Beta-2 adrenergic receptor
Ligand
BDBM82482
Substrate
Ki
10.23±n/a nM
Comments
PDSP_1892
Citation
 Fraundorfer, PFFertel, RHMiller, DDFeller, DR Biochemical and pharmacological characterization of high-affinity trimetoquinol analogs on guinea pig and human beta adrenergic receptor subtypes: evidence for partial agonism. J Pharmacol Exp Ther 270:665-74 (1994) Target
Name:
Beta-2 adrenergic receptor
Synonyms:
ADRB2 ADRB2_HUMAN Beta-2 adrenoceptor | Beta-2 adrenoreceptor
Type:
Mol. Mass.:
46461.69
Organism:
Homo sapiens (Human)
Description:
P07550
Residue:
413
  
Inhibitor
Name:
BDBM82482
Synonyms:
TMQ, S-(+)-8-Fluoro
Type:
Small organic molecule
Emp. Form.:
C19H22FNO5
Mol. Mass.:
363.3801
SMILES:
COc1cc(C[C@@H]2NCCc3cc(O)c(O)c(F)c23)cc(OC)c1OC
: