Target
Melatonin receptor type 1B
Ligand
BDBM50043289
Substrate
Ki
2±n/a nM
Comments
PDSP_1195
Citation
 Reppert, SMWeaver, DREbisawa, T Cloning and characterization of a mammalian melatonin receptor that mediates reproductive and circadian responses. Neuron 13:1177-85 (1994)  
Target
Name:
Melatonin receptor type 1B
Synonyms:
MTNR1B Mel-1B-R Melatonin 1B Melatonin receptor type 1B | Melatonin receptor type 2 (MT2)
Type:
Enzyme
Mol. Mass.:
40203.54
Organism:
Homo sapiens (Human)
Description:
P49286
Residue:
362
  
Inhibitor
Name:
BDBM50043289
Synonyms:
CHEMBL34730 N-[2-(6-Chloro-5-methoxy-1H-indol-3-yl)-ethyl]-acetamide(6-Chloromelatonin) | melatonin, 6-Chloro
Type:
Small organic molecule
Emp. Form.:
C13H15ClN2O2
Mol. Mass.:
266.723
SMILES:
COc1cc2c(CCNC(C)=O)c[nH]c2cc1Cl
: