Target
Melatonin receptor type 1B
Ligand
BDBM82271
Substrate
Ki
170±n/a nM
Comments
PDSP_1292
Citation
 Reppert, SMWeaver, DREbisawa, T Cloning and characterization of a mammalian melatonin receptor that mediates reproductive and circadian responses. Neuron 13:1177-85 (1994)  
Target
Name:
Melatonin receptor type 1B
Synonyms:
MTNR1B Mel-1B-R Melatonin 1B Melatonin receptor type 1B | Melatonin receptor type 2 (MT2)
Type:
Enzyme
Mol. Mass.:
40203.54
Organism:
Homo sapiens (Human)
Description:
P49286
Residue:
362
  
Inhibitor
Name:
BDBM82271
Synonyms:
CAS_260803 NSC_260803
Type:
Small organic molecule
Emp. Form.:
C12H14N2O2
Mol. Mass.:
218.2518
SMILES:
CC(=O)n1cc(CCN)c2cc(O)ccc12
: