Target
5-hydroxytryptamine receptor 1B
Ligand
BDBM81497
Substrate
Ki
0.04±n/a nM
Comments
PDSP_491
Citation
 Boess, FGMartin, IL Molecular biology of 5-HT receptors. Neuropharmacology 33:275-317 (1994)  
Target
Name:
5-hydroxytryptamine receptor 1B
Synonyms:
5-HT-1B 5-HT1B 5HT1B_HUMAN HTR1DB Serotonin (5-HT) receptor Serotonin Receptor 1B
Type:
G Protein-Coupled Receptor (GPCR)
Mol. Mass.:
43579.17
Organism:
Homo sapiens (Human)
Description:
Receptor binding assays were performed using human clone stably expressed in CHO cells
Residue:
390
  
Inhibitor
Name:
BDBM81497
Synonyms:
4-(4-Methyl-piperazin-1-yl)-7-trifluoromethyl-pyrrolo[1,2-a]quinoxaline CGS 12066B NSC_123945
Type:
Small organic molecule
Emp. Form.:
C17H17F3N4
Mol. Mass.:
334.3389
SMILES:
CN1CCN(CC1)c1nc2cc(ccc2n2cccc12)C(F)(F)F
: