Target
5-hydroxytryptamine receptor 1B
Ligand
BDBM81499
Substrate
Ki
2.51±n/a nM
Comments
PDSP_596
Citation
 Boess, FGMartin, IL Molecular biology of 5-HT receptors. Neuropharmacology 33:275-317 (1994)  
Target
Name:
5-hydroxytryptamine receptor 1B
Synonyms:
5-HT1B 5HT1B_MOUSE Htr1b
Type:
Enzyme
Mol. Mass.:
43090.29
Organism:
Mus musculus (Mouse)
Description:
P28334
Residue:
386
  
Inhibitor
Name:
BDBM81499
Synonyms:
CAS_155346 CYANOPINDOLOL(+/-) | NSC_155346
Type:
Small organic molecule
Emp. Form.:
C16H21N3O2
Mol. Mass.:
287.3568
SMILES:
CC(C)(C)NCC(O)COc1cccc2[nH]c(cc12)C#N
: