Target
5-hydroxytryptamine receptor 1D
Ligand
BDBM81499
Substrate
Ki
36.3±n/a nM
Comments
PDSP_599
Citation
 Boess, FGMartin, IL Molecular biology of 5-HT receptors. Neuropharmacology 33:275-317 (1994)  
Target
Name:
5-hydroxytryptamine receptor 1D
Synonyms:
5-HT-1D 5-hydroxytryptamine receptor 1D Htr1d Serotonin 1B/1D receptor | Serotonin receptor 1D
Type:
Enzyme Catalytic Domain
Mol. Mass.:
41551.75
Organism:
RAT
Description:
5-HT1D HTR1D RAT::P28565
Residue:
374
  
Inhibitor
Name:
BDBM81499
Synonyms:
CAS_155346 CYANOPINDOLOL(+/-) | NSC_155346
Type:
Small organic molecule
Emp. Form.:
C16H21N3O2
Mol. Mass.:
287.3568
SMILES:
CC(C)(C)NCC(O)COc1cccc2[nH]c(cc12)C#N
: