Target
5-hydroxytryptamine receptor 1D
Ligand
BDBM50007406
Substrate
Ki
58.88±n/a nM
Comments
PDSP_1808
Citation
 Boess, FGMartin, IL Molecular biology of 5-HT receptors. Neuropharmacology 33:275-317 (1994)  
Target
Name:
5-hydroxytryptamine receptor 1D
Synonyms:
5-HT-1D 5-hydroxytryptamine receptor 1D Htr1d Serotonin 1B/1D receptor | Serotonin receptor 1D
Type:
Enzyme Catalytic Domain
Mol. Mass.:
41551.75
Organism:
RAT
Description:
5-HT1D HTR1D RAT::P28565
Residue:
374
  
Inhibitor
Name:
BDBM50007406
Synonyms:
1-(3-(trifluoromethyl)phenyl)piperazine 1-(3-Trifluoromethyl-phenyl)-piperazine(TFMPP) TFMPP
Type:
Small organic molecule
Emp. Form.:
C11H13F3N2
Mol. Mass.:
230.2295
SMILES:
FC(F)(F)c1cccc(c1)N1CCNCC1
: