Target
5-hydroxytryptamine receptor 2A
Ligand
BDBM50007406
Substrate
Ki
301.99±n/a nM
Comments
PDSP_1808
Citation
 Boess, FGMartin, IL Molecular biology of 5-HT receptors. Neuropharmacology 33:275-317 (1994)  
Target
Name:
5-hydroxytryptamine receptor 2A
Synonyms:
5-HT-2A 5-HT2A 5-hydroxytryptamine receptor 2A (5HT2A) Htr2 Serotonin Receptor 2A
Type:
G Protein-Coupled Receptor (GPCR)
Mol. Mass.:
52852.05
Organism:
Rattus norvegicus (rat)
Description:
Rat cortex membranes 5-HT2A receptors.
Residue:
471
  
Inhibitor
Name:
BDBM50007406
Synonyms:
1-(3-(trifluoromethyl)phenyl)piperazine 1-(3-Trifluoromethyl-phenyl)-piperazine(TFMPP) TFMPP
Type:
Small organic molecule
Emp. Form.:
C11H13F3N2
Mol. Mass.:
230.2295
SMILES:
FC(F)(F)c1cccc(c1)N1CCNCC1
: