Target
5-hydroxytryptamine receptor 5A
Ligand
BDBM50027065
Substrate
Ki
3.98±n/a nM
Comments
PDSP_797
Citation
 Boess, FGMartin, IL Molecular biology of 5-HT receptors. Neuropharmacology 33:275-317 (1994)  
Target
Name:
5-hydroxytryptamine receptor 5A
Synonyms:
5-HT-5 5-HT5 5-hydroxytryptamine receptor 5A 5ht5a Serotonin 5a (5-HT5a) receptor | Serotonin receptor 5A
Type:
Enzyme Catalytic Domain
Mol. Mass.:
40749.33
Organism:
MOUSE
Description:
5-HT5 0 MOUSE::P30966
Residue:
357
  
Inhibitor
Name:
BDBM50027065
Synonyms:
(5'alpha)-12'-hydroxy-2'-methyl-5'-(phenylmethyl)ergotoman-3',6',18-trione 12'-hydroxy-2'-methyl-5'alpha-(phenylmethyl)ergotaman-3',6',18-trione Ergotamin
Type:
Small organic molecule
Emp. Form.:
C33H35N5O5
Mol. Mass.:
581.6615
SMILES:
CN1C[C@@H](C=C2[C@H]1Cc1c[nH]c3cccc2c13)C(=O)N[C@]1(C)O[C@@]2(O)[C@@H]3CCCN3C(=O)[C@H](Cc3ccccc3)N2C1=O
: