Target
Adenosine receptor A2a
Ligand
BDBM50096295
Substrate
Ki
>10000±n/a nM
Comments
PDSP_2564
Citation
 van Galen, PJvan Bergen, AHGallo-Rodriguez, CMelman, NOlah, MEIJzerman, APStiles, GLJacobson, KA A binding site model and structure-activity relationships for the rat A3 adenosine receptor. Mol Pharmacol 45:1101-11 (1994) Target
Name:
Adenosine receptor A2a
Synonyms:
AA2AR_RAT Adenosine A2 receptor Adenosine Receptors A2a (A2a) Adenosine receptors A2a Rat striatal adenosine A2a receptor
Type:
G Protein-Coupled Receptor (GPCR)
Mol. Mass.:
45015.65
Organism:
Rattus norvegicus (rat)
Description:
Rat A2A receptors expressed in CHO cells.
Residue:
410
  
Inhibitor
Name:
BDBM50096295
Synonyms:
Uridine hydrogen ({[5-(2,4-dioxo-1,2,3,4-tetrahydropyrimidin-1-yl)-3,4-dihydroxyoxolan-2-yl]methyl phosphonato}oxy)phosphonate
Type:
Small organic molecule
Emp. Form.:
C9H12N2O12P2
Mol. Mass.:
402.1464
SMILES:
OC1C(O)C(OC1COP([O-])(=O)OP(O)([O-])=O)n1ccc(=O)[nH]c1=O
: