Target
Transmembrane and immunoglobulin domain-containing 3
Ligand
BDBM18137
Substrate
Ki
>10000±n/a nM
Comments
PDSP_2560
Citation
 van Galen, PJvan Bergen, AHGallo-Rodriguez, CMelman, NOlah, MEIJzerman, APStiles, GLJacobson, KA A binding site model and structure-activity relationships for the rat A3 adenosine receptor. Mol Pharmacol 45:1101-11 (1994) Target
Name:
Transmembrane and immunoglobulin domain-containing 3
Synonyms:
ADENOSINE A3 Adora3 protein
Type:
Enzyme Catalytic Domain
Mol. Mass.:
25707.75
Organism:
RAT
Description:
Q4V8H0
Residue:
232
  
Inhibitor
Name:
BDBM18137
Synonyms:
AMP US11185100, TABLE 7.3 adenosine 5 -monophosphate | {[(2R,3S,4R,5R)-5-(6-amino-9H-purin-9-yl)-3,4-dihydroxyoxolan-2-yl]methoxy}phosphonic acid
Type:
Nucleoside or nucleotide
Emp. Form.:
C10H14N5O7P
Mol. Mass.:
347.2212
SMILES:
Nc1ncnc2n(cnc12)[C@@H]1O[C@H](COP(O)(O)=O)[C@@H](O)[C@H]1O
: