Target
Nicotinic acetylcholine receptor
Ligand
BDBM50061567
Substrate
Ki
28.8±n/a nM
Comments
PDSP_691
Citation
 Khan, IMYaksh, TLTaylor, P Ligand specificity of nicotinic acetylcholine receptors in rat spinal cord: studies with nicotine and cytisine. J Pharmacol Exp Ther 270:159-66 (1994) Target
Name:
Nicotinic acetylcholine receptor
Synonyms:
Nicotinic acetylcholine receptor | n-AChR
Type:
Enzyme Catalytic Domain
Mol. Mass.:
2478.99
Organism:
RAT
Description:
n-AChR 0 RAT::Q62594
Residue:
23
  
Inhibitor
Name:
BDBM50061567
Synonyms:
1,1-Dimethyl-4-phenyl-piperazin-1-ium CHEMBL47814 cid_5911
Type:
Small organic molecule
Emp. Form.:
C12H19N2
Mol. Mass.:
191.2921
SMILES:
C[N+]1(C)CCN(CC1)c1ccccc1
: