Target
Nicotinic acetylcholine receptor
Ligand
BDBM50054820
Substrate
Ki
261±n/a nM
Comments
PDSP_1228
Citation
 Khan, IMYaksh, TLTaylor, P Ligand specificity of nicotinic acetylcholine receptors in rat spinal cord: studies with nicotine and cytisine. J Pharmacol Exp Ther 270:159-66 (1994) Target
Name:
Nicotinic acetylcholine receptor
Synonyms:
Nicotinic acetylcholine receptor | n-AChR
Type:
Enzyme Catalytic Domain
Mol. Mass.:
2478.99
Organism:
RAT
Description:
n-AChR 0 RAT::Q62594
Residue:
23
  
Inhibitor
Name:
BDBM50054820
Synonyms:
Methyllycaconitine | [(1S,4S,5R,6S,8R,9R,13S,16S,18S)-11-ethyl-8,9-dihydroxy-4,6,16,18-tetramethoxy-11-azahexacyclo[7.7.2.1^{2,5}.0^{1,10}.0^{3,8}.0^{13,17}]nonadecan-13-yl]methyl 2-[(3S)-3-methyl-2,5-dioxopyrrolidin-1-yl]benzoate
Type:
Small organic molecule
Emp. Form.:
C37H50N2O10
Mol. Mass.:
682.8003
SMILES:
CCN1C[C@]2(COC(=O)c3ccccc3-n3c(O)cc(C)c3O)CC[C@H](OC)[C@@]34C5C[C@H]6[C@H](OC)C5[C@](O)(C[C@@H]6OC)[C@](O)([C@@H](OC)C23)C14
: