Target
Muscarinic acetylcholine receptor M5
Ligand
BDBM28347
Substrate
Ki
11±n/a nM
Comments
PDSP_1203
Citation
 Stanton, TBolden-Watson, CCusack, BRichelson, E Antagonism of the five cloned human muscarinic cholinergic receptors expressed in CHO-K1 cells by antidepressants and antihistaminics. Biochem Pharmacol 45:2352-4 (1993)  
Target
Name:
Muscarinic acetylcholine receptor M5
Synonyms:
ACM5_HUMAN | CHRM5
Type:
PROTEIN
Mol. Mass.:
60102.35
Organism:
Homo sapiens (Human)
Description:
ChEMBL_1517990
Residue:
532
  
Inhibitor
Name:
BDBM28347
Synonyms:
3-(10H-phenothiazin-10-ylmethyl)-1-azabicyclo[2.2.2]octan-1-ium ZINC01567421, 6
Type:
Small organic molecule
Emp. Form.:
C20H23N2S
Mol. Mass.:
323.474
SMILES:
C(C1C[NH+]2CCC1CC2)N1c2ccccc2Sc2ccccc12
: