Target
Delta-type opioid receptor
Ligand
BDBM50018708
Substrate
Ki
4.8±n/a nM
Comments
PDSP_758
Citation
 Raynor, KKong, HChen, YYasuda, KYu, LBell, GIReisine, T Pharmacological characterization of the cloned kappa-, delta-, and mu-opioid receptors. Mol Pharmacol 45:330-4 (1994) Target
Name:
Delta-type opioid receptor
Synonyms:
D-OR-1 Delta opioid receptor OPIATE Delta OPRD1 OPRK1 | opioid receptor, delta 1
Type:
G Protein-Coupled Receptor (GPCR)
Mol. Mass.:
40382.98
Organism:
Homo sapiens (Human)
Description:
Competition binding assays were carried out using membrane preparations from transfected HN9.10 cells that constitutively expressed the delta opioid receptor.
Residue:
372
  
Inhibitor
Name:
BDBM50018708
Synonyms:
2-{2-[2-(2-{2-[2-Amino-3-(4-hydroxy-phenyl)-propionylamino]-3-hydroxy-propionylamino}-acetylamino)-3-phenyl-propionylamino]-4-methyl-pentanoylamino}-3-hydroxy-butyric acid DSLET Tyr-D-Ser-Gly-Phe-Leu-Thr
Type:
Small organic molecule
Emp. Form.:
C33H46N6O10
Mol. Mass.:
686.7525
SMILES:
CC(C)C[C@H](NC(=O)[C@H](Cc1ccccc1)NC(=O)CNC(=O)[C@@H](CO)NC(=O)[C@@H](N)Cc1ccc(O)cc1)C(=O)N[C@@H]([C@@H](C)O)C(O)=O
: