Target
Delta-type opioid receptor
Ligand
BDBM82555
Substrate
Ki
8.6±n/a nM
Comments
PDSP_1281
Citation
 Raynor, KKong, HChen, YYasuda, KYu, LBell, GIReisine, T Pharmacological characterization of the cloned kappa-, delta-, and mu-opioid receptors. Mol Pharmacol 45:330-4 (1994) Target
Name:
Delta-type opioid receptor
Synonyms:
D-OR-1 Delta opioid receptor OPIATE Delta OPRD1 OPRK1 | opioid receptor, delta 1
Type:
G Protein-Coupled Receptor (GPCR)
Mol. Mass.:
40382.98
Organism:
Homo sapiens (Human)
Description:
Competition binding assays were carried out using membrane preparations from transfected HN9.10 cells that constitutively expressed the delta opioid receptor.
Residue:
372
  
Inhibitor
Name:
BDBM82555
Synonyms:
CAS_4424 Naloxonazine
Type:
Small organic molecule
Emp. Form.:
C38H42N4O6
Mol. Mass.:
650.7633
SMILES:
Oc1ccc2CC3N(CC=C)CCC45C(Oc1c24)C(CCC35O)=NN=C1CCC2(O)C3Cc4ccc(O)c5OC1C2(CCN3CC=C)c45
: