Target
Delta-type opioid receptor
Ligand
BDBM50044897
Substrate
Ki
1000±n/a nM
Comments
PDSP_1507
Citation
 Raynor, KKong, HChen, YYasuda, KYu, LBell, GIReisine, T Pharmacological characterization of the cloned kappa-, delta-, and mu-opioid receptors. Mol Pharmacol 45:330-4 (1994) Target
Name:
Delta-type opioid receptor
Synonyms:
D-OR-1 Delta opioid receptor OPIATE Delta OPRD1 OPRK1 | opioid receptor, delta 1
Type:
G Protein-Coupled Receptor (GPCR)
Mol. Mass.:
40382.98
Organism:
Homo sapiens (Human)
Description:
Competition binding assays were carried out using membrane preparations from transfected HN9.10 cells that constitutively expressed the delta opioid receptor.
Residue:
372
  
Inhibitor
Name:
BDBM50044897
Synonyms:
CHEMBL163808 Tyr-Pro-D-(NMe)Phe-D-Pro-NH2
Type:
Small organic molecule
Emp. Form.:
C29H37N5O5
Mol. Mass.:
535.6346
SMILES:
CN([C@H](Cc1ccccc1)C(=O)N1CCC[C@@H]1C(N)=O)C(=O)C1CCCN1C(=O)C(N)Cc1ccc(O)cc1
: