Target
Delta-type opioid receptor
Ligand
BDBM50045216
Substrate
Ki
1.7±n/a nM
Comments
PDSP_1713
Citation
 Raynor, KKong, HChen, YYasuda, KYu, LBell, GIReisine, T Pharmacological characterization of the cloned kappa-, delta-, and mu-opioid receptors. Mol Pharmacol 45:330-4 (1994) Target
Name:
Delta-type opioid receptor
Synonyms:
D-OR-1 Delta opioid receptor OPIATE Delta OPRD1 OPRK1 | opioid receptor, delta 1
Type:
G Protein-Coupled Receptor (GPCR)
Mol. Mass.:
40382.98
Organism:
Homo sapiens (Human)
Description:
Competition binding assays were carried out using membrane preparations from transfected HN9.10 cells that constitutively expressed the delta opioid receptor.
Residue:
372
  
Inhibitor
Name:
BDBM50045216
Synonyms:
7-(Spiroindano)Oxymorphone SIOM
Type:
Small organic molecule
Emp. Form.:
C25H25NO4
Mol. Mass.:
403.4703
SMILES:
CN1CC[C@@]23[C@H]4Oc5c2c(CC1[C@]3(O)CC1(Cc2ccccc2C1)C4=O)ccc5O
: