Target
Kappa-type opioid receptor
Ligand
BDBM82550
Substrate
Ki
1000±n/a nM
Comments
PDSP_637
Citation
 Raynor, KKong, HChen, YYasuda, KYu, LBell, GIReisine, T Pharmacological characterization of the cloned kappa-, delta-, and mu-opioid receptors. Mol Pharmacol 45:330-4 (1994) Target
Name:
Kappa-type opioid receptor
Synonyms:
K-OR-1 Kappa-opioid receptor (KOR) Kappa-type opioid receptor (KOR) OPIATE Kappa OPRK1 kappa opioid receptor (KOR)
Type:
G Protein-Coupled Receptor (GPCR)
Mol. Mass.:
42648.76
Organism:
Homo sapiens (Human)
Description:
P41145
Residue:
380
  
Inhibitor
Name:
BDBM82550
Synonyms:
CAS_118476-87-2 NSC_125954
Type:
Small organic molecule
Emp. Form.:
C43H57N11O10
Mol. Mass.:
887.9804
SMILES:
[#7]-[#6](-[#6]-c1ccc(-[#8])cc1)-[#6](=O)-[#7]-[#6](-[#6]-[#6]-[#6]\[#7]=[#6](/[#7])-[#7])-[#6](=O)-[#7]-[#6](-[#6]-c1ccccc1)-[#6](=O)-[#7]-[#6]-[#6](=O)-[#7]-[#6](-[#6]-c1ccc(-[#8])cc1)-[#6](=O)-[#7]-1-[#6]-[#6]-[#6]-[#6]-1-[#6](=O)-[#7]-[#6](-[#6]-[#8])-[#6](-[#7])=O
: