Target
Kappa-type opioid receptor
Ligand
BDBM50044897
Substrate
Ki
1000±n/a nM
Comments
PDSP_1507
Citation
 Raynor, KKong, HChen, YYasuda, KYu, LBell, GIReisine, T Pharmacological characterization of the cloned kappa-, delta-, and mu-opioid receptors. Mol Pharmacol 45:330-4 (1994) Target
Name:
Kappa-type opioid receptor
Synonyms:
K-OR-1 Kappa-opioid receptor (KOR) Kappa-type opioid receptor (KOR) OPIATE Kappa OPRK1 kappa opioid receptor (KOR)
Type:
G Protein-Coupled Receptor (GPCR)
Mol. Mass.:
42648.76
Organism:
Homo sapiens (Human)
Description:
P41145
Residue:
380
  
Inhibitor
Name:
BDBM50044897
Synonyms:
CHEMBL163808 Tyr-Pro-D-(NMe)Phe-D-Pro-NH2
Type:
Small organic molecule
Emp. Form.:
C29H37N5O5
Mol. Mass.:
535.6346
SMILES:
CN([C@H](Cc1ccccc1)C(=O)N1CCC[C@@H]1C(N)=O)C(=O)C1CCCN1C(=O)C(N)Cc1ccc(O)cc1
: