Target
5-hydroxytryptamine receptor 6
Ligand
BDBM10755
Substrate
Ki
39.81±n/a nM
Comments
PDSP_150
Citation
 Unsworth, CDMolinoff, PB Characterization of a 5-hydroxytryptamine receptor in mouse neuroblastoma N18TG2 cells. J Pharmacol Exp Ther 269:246-55 (1994) Target
Name:
5-hydroxytryptamine receptor 6
Synonyms:
5-HT6 5HT6R_MOUSE | Htr6
Type:
Enzyme Catalytic Domain
Mol. Mass.:
47012.98
Organism:
MOUSE
Description:
5-HT6 HTR6 MOUSE::Q9R1C8
Residue:
440
  
Inhibitor
Name:
BDBM10755
Synonyms:
14C-5-hydroxy tryptamine creatinine disulfate 5-HT 5-hydroxy tryptamine creatinine disulfate Serotonin | [3H]-5-HT
Type:
Small organic molecule
Emp. Form.:
C10H12N2O
Mol. Mass.:
176.2151
SMILES:
NCCc1c[nH]c2ccc(O)cc12
: