Target
5-hydroxytryptamine receptor 6
Ligand
BDBM78940
Substrate
Ki
0.39±n/a nM
Comments
PDSP_1219
Citation
 Bard, JAZgombick, JAdham, NVaysse, PBranchek, TAWeinshank, RL Cloning of a novel human serotonin receptor (5-HT7) positively linked to adenylate cyclase. J Biol Chem 268:23422-6 (1993) Target
Name:
5-hydroxytryptamine receptor 6
Synonyms:
5-HT-6 5-hydroxytryptamine receptor 6 (5-HT-6) 5-hydroxytryptamine receptor 6 (5HT6) HTR6 Serotonin 6 (5-HT6) receptor | Serotonin Receptor 6
Type:
G Protein-Coupled Receptor (GPCR)
Mol. Mass.:
46968.43
Organism:
Homo sapiens (Human)
Description:
P50406
Residue:
440
  
Inhibitor
Name:
BDBM78940
Synonyms:
METHIOTHEPIN Methiothepin mesylate salt cid_3039995 methanesulfonic acid;1-methyl-4-(3-methylsulfanyl-5,6-dihydrobenzo[b][1]benzothiepin-5-yl)piperazine | methanesulfonic acid;1-methyl-4-[3-(methylthio)-5,6-dihydrobenzo[b][1]benzothiepin-5-yl]piperazine
Type:
Small organic molecule
Emp. Form.:
C20H24N2S2
Mol. Mass.:
356.548
SMILES:
CSc1ccc2Sc3ccccc3CC(N3CCN(C)CC3)c2c1
: