Target
Glutamate receptor ionotropic, kainate 4
Ligand
BDBM50002370
Substrate
Ki
1970±n/a nM
Comments
PDSP_292
Citation
 Kamboj, RKSchoepp, DDNutt, SShekter, LKorczak, BTrue, RARampersad, VZimmerman, DMWosnick, MA Molecular cloning, expression, and pharmacological characterization of humEAA1, a human kainate receptor subunit. J Neurochem 62:1-9 (1994)  
Target
Name:
Glutamate receptor ionotropic, kainate 4
Synonyms:
GRIK GRIK4 protein Glutamate-Kainate EAA1
Type:
Enzyme Catalytic Domain
Mol. Mass.:
107246.86
Organism:
Homo sapiens (Human)
Description:
Q16099
Residue:
956
  
Inhibitor
Name:
BDBM50002370
Synonyms:
(R,S)-alpha-amino-3-hydroxy-5-methyl-4-isooxazole-propionic acid 2-Amino-3-(3-hydroxy-5-methyl-isoxazol-4-yl)-propionic acid 2-amino-3-(3-hydroxy-5-methyl-4-isoxazolyl)-propionic acid 2-ammonio-3-(3-hydroxy-5-methylisoxazol-4-yl)propanoate CHEMBL13378
Type:
Small organic molecule
Emp. Form.:
C7H10N2O4
Mol. Mass.:
186.1653
SMILES:
Cc1o[nH]c(=O)c1CC(N)C(O)=O
: