Target
Glutamate receptor ionotropic, kainate 4
Ligand
BDBM50002343
Substrate
Ki
>10000±n/a nM
Comments
PDSP_1341
Citation
 Kamboj, RKSchoepp, DDNutt, SShekter, LKorczak, BTrue, RARampersad, VZimmerman, DMWosnick, MA Molecular cloning, expression, and pharmacological characterization of humEAA1, a human kainate receptor subunit. J Neurochem 62:1-9 (1994)  
Target
Name:
Glutamate receptor ionotropic, kainate 4
Synonyms:
GRIK GRIK4 protein Glutamate-Kainate EAA1
Type:
Enzyme Catalytic Domain
Mol. Mass.:
107246.86
Organism:
Homo sapiens (Human)
Description:
Q16099
Residue:
956
  
Inhibitor
Name:
BDBM50002343
Synonyms:
2-Methylamino-succinic acid NMDA
Type:
Small organic molecule
Emp. Form.:
C5H9NO4
Mol. Mass.:
147.1293
SMILES:
CNC(CC(O)=O)C(O)=O
: