Target
D(2) dopamine receptor
Ligand
BDBM85091
Substrate
Ki
25±n/a nM
Comments
PDSP_244
Citation
 Freedman, SBPatel, SMarwood, REmms, FSeabrook, GRKnowles, MRMcAllister, G Expression and pharmacological characterization of the human D3 dopamine receptor. J Pharmacol Exp Ther 268:417-26 (1994) Target
Name:
D(2) dopamine receptor
Synonyms:
D(2) dopamine receptor DOPAMINE D2 Long DRD2 Dopamine D2 receptor Dopamine D2 receptor (D2R) Dopamine2-like | d2
Type:
Cell-surface receptors
Mol. Mass.:
50647.10
Organism:
Homo sapiens (Human)
Description:
P14416
Residue:
443
  
Inhibitor
Name:
BDBM85091
Synonyms:
(+/-)-2-DIPROPYLAMINO- 6,7-DIHYDROXY-1,2,3,4-TETRAHYDRONAPHTHALENE CAS_62421-17-4 dp-ADTN
Type:
Small organic molecule
Emp. Form.:
C16H25NO2
Mol. Mass.:
263.3752
SMILES:
CCCN(CCC)C1CCc2cc(O)c(O)cc2C1
: