Target
Apoptotic protease-activating factor 1
Ligand
BDBM34645
Substrate
Meas. Tech.
Dose response confirmation of uHTS hits for Apaf-1 in a Fluorescent assay
IC50
1940±n/a nM
Citation
 PubChem, PC Dose response confirmation of uHTS hits for Apaf-1 in a Fluorescent assay PubChem Bioassay (2011)[AID] 
Target
Name:
Apoptotic protease-activating factor 1
Synonyms:
APAF1 Apoptotic peptidase activating factor 1 | KIAA0413
Type:
Enzyme Catalytic Domain
Mol. Mass.:
141834.40
Organism:
Homo sapiens (Human)
Description:
O14727
Residue:
1248
  
Inhibitor
Name:
BDBM34645
Synonyms:
MLS000106918 SMR000111294 cycloheptyl(1H-indazol-6-yl)amine
Type:
Small organic molecule
Emp. Form.:
C14H19N3
Mol. Mass.:
229.3208
SMILES:
C1CCCC(CC1)Nc1ccc2cn[nH]c2c1
: