Target
Apoptotic protease-activating factor 1
Ligand
BDBM57185
Substrate
Meas. Tech.
Dose response confirmation of uHTS hits for Apaf-1 in a Fluorescent assay
IC50
2610±n/a nM
Citation
 PubChem, PC Dose response confirmation of uHTS hits for Apaf-1 in a Fluorescent assay PubChem Bioassay (2011)[AID] 
Target
Name:
Apoptotic protease-activating factor 1
Synonyms:
APAF1 Apoptotic peptidase activating factor 1 | KIAA0413
Type:
Enzyme Catalytic Domain
Mol. Mass.:
141834.40
Organism:
Homo sapiens (Human)
Description:
O14727
Residue:
1248
  
Inhibitor
Name:
BDBM57185
Synonyms:
4-(2-Hydroxy-phenylamino)-[1,2]naphthoquinone 4-(2-hydroxyanilino)naphthalene-1,2-dione MLS000550900 cid_1895705
Type:
Small organic molecule
Emp. Form.:
C16H11NO3
Mol. Mass.:
265.2634
SMILES:
Oc1ccccc1NC1=CC(=O)C(=O)c2ccccc12
: