Target
Apoptotic protease-activating factor 1
Ligand
BDBM42221
Substrate
Meas. Tech.
Dose response confirmation of uHTS hits for Apaf-1 in a Fluorescent assay
IC50
2910±n/a nM
Citation
 PubChem, PC Dose response confirmation of uHTS hits for Apaf-1 in a Fluorescent assay PubChem Bioassay (2011)[AID] 
Target
Name:
Apoptotic protease-activating factor 1
Synonyms:
APAF1 Apoptotic peptidase activating factor 1 | KIAA0413
Type:
Enzyme Catalytic Domain
Mol. Mass.:
141834.40
Organism:
Homo sapiens (Human)
Description:
O14727
Residue:
1248
  
Inhibitor
Name:
BDBM42221
Synonyms:
2-({4-[3-(4-hydroxyphenyl)acryloyl]phenyl}amino)-3-(1-piperidinyl)naphthoquinone 2-[4-[(E)-3-(4-hydroxyphenyl)acryloyl]anilino]-3-piperidino-1,4-naphthoquinone 2-[[4-[(E)-3-(4-hydroxyphenyl)prop-2-enoyl]phenyl]amino]-3-piperidin-1-yl-naphthalene-1,4-dione SMR000186576 | cid_5341375
Type:
Small organic molecule
Emp. Form.:
C30H26N2O4
Mol. Mass.:
478.5384
SMILES:
Oc1ccc(C=CC(=O)c2ccc(NC3=C(N4CCCCC4)C(=O)c4ccccc4C3=O)cc2)cc1
: