Target
Apoptotic protease-activating factor 1
Ligand
BDBM71166
Substrate
Meas. Tech.
Dose response confirmation of uHTS hits for Apaf-1 in a Fluorescent assay
IC50
26200±n/a nM
Citation
 PubChem, PC Dose response confirmation of uHTS hits for Apaf-1 in a Fluorescent assay PubChem Bioassay (2011)[AID] 
Target
Name:
Apoptotic protease-activating factor 1
Synonyms:
APAF1 Apoptotic peptidase activating factor 1 | KIAA0413
Type:
Enzyme Catalytic Domain
Mol. Mass.:
141834.40
Organism:
Homo sapiens (Human)
Description:
O14727
Residue:
1248
  
Inhibitor
Name:
BDBM71166
Synonyms:
4-[Acetyl-(3-morpholin-4-yl-1,4-dioxo-1,4-dihydro-naphthalen-2-yl)-amino]-benzoic acid 4-[acetyl-(3-morpholin-4-yl-1,4-dioxonaphthalen-2-yl)amino]benzoic acid 4-[ethanoyl-[3-morpholin-4-yl-1,4-bis(oxidanylidene)naphthalen-2-yl]amino]benzoic acid SMR000413921 | cid_2833927
Type:
Small organic molecule
Emp. Form.:
C23H20N2O6
Mol. Mass.:
420.4147
SMILES:
CC(=O)N(C1=C(N2CCOCC2)C(=O)c2ccccc2C1=O)c1ccc(cc1)C(O)=O
: