Target
Toll-like receptor 7
Ligand
BDBM273470
Substrate
Meas. Tech.
TLR7/8/9 Inhibition Reporter Assay
Temperature
298.15±n/a K
IC50
0.200±n/a nM
Comments
extracted
Citation
 Dyckman, AJDodd, DSMacor, JEMussari, CPPasunoori, LKumar, SRSherwood, TCSistla, RK [1,2,4]triazolo[1,5-a]pyridinyl substituted indole compounds US Patent  US10071079 Publication Date 9/11/2018 
Target
Name:
Toll-like receptor 7
Synonyms:
ORF Names:UNQ248/PRO285 TLR7_HUMAN | Toll-like receptor 7 (TLR7)
Type:
Enzyme
Mol. Mass.:
120945.35
Organism:
Homo sapiens (Human)
Description:
Q9NYK1
Residue:
1049
  
Inhibitor
Name:
BDBM273470
Synonyms:
US10071079, Example 253 US10478424, Example 263
Type:
Small organic molecule
Emp. Form.:
C26H33N5O3S
Mol. Mass.:
495.637
SMILES:
COc1cc(cn2ncnc12)-c1[nH]c2ccc(cc2c1C(C)C)C1CCN(CCS(C)(=O)=O)CC1
: