Target
Alpha-mannosidase 2
Ligand
BDBM84474
Substrate
pH
5.6±0
Temperature
310.15±0 K
Ki
4.4e+3±n/a nM
Citation
 Li, BKawatkar, SPGeorge, SStrachan, HWoods, RJSiriwardena, AMoremen, KWBoons, GJ Inhibition of Golgi mannosidase II with mannostatin A analogues: synthesis, biological evaluation, and structure-activity relationship studies. Chembiochem 5:1220-7 (2004)  
Target
Name:
Alpha-mannosidase 2
Synonyms:
Alpha-mannosidase 2A1 Lysosomal acid alpha-mannosidase MAN2A1 Mannosidase alpha class 2A member 1 Mannosyl-oligosaccharide 1,3-1,6-alpha-mannosidase
Type:
Protein
Mol. Mass.:
131156.65
Organism:
Homo sapiens (Human)
Description:
Q16706
Residue:
1144
  
Inhibitor
Name:
BDBM84474
Synonyms:
Aminocyclopentitetrol, 2g
Type:
Small organic molecule
Emp. Form.:
C16H21NO6
Mol. Mass.:
323.341
SMILES:
O[C@H]1[C@@H](O)[C@@H](O)[C@@H](NCc2ccc(cc2)C(=O)OCC=C)[C@H]1O
: