Target
Somatostatin receptor type 2
Ligand
BDBM84621
Substrate
Ki
0.24±n/a nM
Comments
PDSP_378
Citation
 Patel, YCSrikant, CB Subtype selectivity of peptide analogs for all five cloned human somatostatin receptors (hsstr 1-5). Endocrinology 135:2814-7 (1994)  
Target
Name:
Somatostatin receptor type 2
Synonyms:
SOMATOSTATIN SST2 SS-2-R SS2R SSTR2 | Somatostatin receptor type 2 (SSTR2)
Type:
Enzyme
Mol. Mass.:
41344.94
Organism:
Homo sapiens (Human)
Description:
P30874
Residue:
369
  
Inhibitor
Name:
BDBM84621
Synonyms:
BIM 23042
Type:
Small organic molecule
Emp. Form.:
C61H69N11O9S2
Mol. Mass.:
1164.399
SMILES:
CC(C)[C@@H]1NC(=O)[C@H](CCCCN)NC(=O)[C@@H](Cc2c[nH]c3ccccc23)NC(=O)[C@H](Cc2ccc(O)cc2)NC(=O)C(NC(=O)C(N)Cc2ccc3ccccc3c2)SSC(NC1=O)C(=O)NC(Cc1ccc2ccccc2c1)C(N)=O
: