Target
Somatostatin receptor type 5
Ligand
BDBM84621
Substrate
Ki
1.15±n/a nM
Comments
PDSP_378
Citation
 Patel, YCSrikant, CB Subtype selectivity of peptide analogs for all five cloned human somatostatin receptors (hsstr 1-5). Endocrinology 135:2814-7 (1994)  
Target
Name:
Somatostatin receptor type 5
Synonyms:
SOMATOSTATIN SST5 SS5-R SSR5_HUMAN Somatostatin receptor type 5 (SSTR5)
Type:
Enzyme
Mol. Mass.:
39218.02
Organism:
Homo sapiens (Human)
Description:
P35346
Residue:
364
  
Inhibitor
Name:
BDBM84621
Synonyms:
BIM 23042
Type:
Small organic molecule
Emp. Form.:
C61H69N11O9S2
Mol. Mass.:
1164.399
SMILES:
CC(C)[C@@H]1NC(=O)[C@H](CCCCN)NC(=O)[C@@H](Cc2c[nH]c3ccccc23)NC(=O)[C@H](Cc2ccc(O)cc2)NC(=O)C(NC(=O)C(N)Cc2ccc3ccccc3c2)SSC(NC1=O)C(=O)NC(Cc1ccc2ccccc2c1)C(N)=O
: