Target
D(2) dopamine receptor
Ligand
BDBM84636
Substrate
Ki
789±n/a nM
Comments
PDSP_3917
Citation
 Seeman, PVan Tol, HH Dopamine D4 receptors bind inactive (+)-aporphines, suggesting neuroleptic role. Sulpiride not stereoselective. Eur J Pharmacol 233:173-4 (1993)  
Target
Name:
D(2) dopamine receptor
Synonyms:
D(2) dopamine receptor DOPAMINE D2 Long DRD2 Dopamine D2 receptor Dopamine D2 receptor (D2R) Dopamine2-like | d2
Type:
Cell-surface receptors
Mol. Mass.:
50647.10
Organism:
Homo sapiens (Human)
Description:
P14416
Residue:
443
  
Inhibitor
Name:
BDBM84636
Synonyms:
CHEMBL27559 | NPA-11-OH-R,(+)
Type:
Small organic molecule
Emp. Form.:
C19H21NO
Mol. Mass.:
279.3761
SMILES:
CCCN1CCc2cccc-3c2[C@H]1Cc1cccc(O)c-31
: